[beagleboard] Re: qt-embedded using OE

Thanks. I was able to finish the build of qt-embedded. I did have another qt related problem when I tried to ‘bitbake qtopia-core-console-image’. The compile failed building some of the native moc tools (see message below). I’m building on opensuse 11.0 and have been able to build qtopia-core for other platforms in this environment.

I’m new to OE and bitbake so I’m not sure what the problem could be.

Any help is deeply appreciated.

---------------------------------------------------


In file included from …/…/include/QtCore/qstring.h:1,
from …/…/include/QtCore/…/…/src/corelib/kernel/qobject.h:43,
from …/…/include/QtCore/qobject.h:1,
from …/…/include/QtCore/…/…/src/corelib/io/qiodevice.h:41,
from …/…/include/QtCore/qiodevice.h:1,
from io/qbuffer.h:40,
from io/qbuffer.cpp:37:
…/…/include/QtCore/…/…/src/corelib/tools/qstring.h:787: warning: type qualifiers ignored on function return type
…/…/include/QtCore/…/…/src/corelib/tools/qstring.h:788: warning: type qualifiers ignored on function return type
…/…/include/QtCore/…/…/src/corelib/tools/qstring.h:789: warning: type qualifiers ignored on function return type
…/…/include/QtCore/…/…/src/corelib/tools/qstring.h:795: warning: type qualifiers ignored on function return type
…/…/include/QtCore/…/…/src/corelib/tools/qstring.h:796: warning: type qualifiers ignored on function return type
In file included from io/qbuffer.cpp:445:
.moc/release-shared-emb-arm/moc_qbuffer.cpp:20: error: expected constructor, destructor, or type conversion before ‘static’
.moc/release-shared-emb-arm/moc_qbuffer.cpp:42: error: ‘qt_meta_data_QBuffer’ was not declared in this scope
.moc/release-shared-emb-arm/moc_qbuffer.cpp:71: error: expected constructor, destructor, or type conversion at end of input
make[1]: *** [.obj/release-shared-emb-arm/qbuffer.o] Error 1
make[1]: Leaving directory `/home/dlamborg/oe/tmp/work/armv7a-angstrom-linux-gnueabi/qtopia-core-4.3.3-r3/qtopia-core-opensource-src-4.3.3/src/corelib’
make: *** [sub-corelib-make_default-ordered] Error 2
FATAL: oe_runmake failed

— On Wed, 5/13/09, Favor Tang tangher@gmail.com wrote:


> From: Favor Tang tangher@gmail.com
> Subject: [beagleboard] Re: qt-embedded using OE
> To: beagleboard@googlegroups.com
> Date: Wednesday, May 13, 2009, 9:29 PM
>
> hi.
>
> this is the error about md5sum dont match your package. maybe your
> package is broken due to the network problem when downloading. And
> make sure that md5sum matches with your download package, please see
> this:
> http://www.nabble.com/md5sum-error-with-bitbake-td18046171.html
>
> I suggest you download this package manually, and see what the md5sum
> is, if the md5sum match with the required checksum by OE, then you
> should copy this package to OE download directory. after that, just
> run bitbake again.
>
> thanks

|